Reaction Details
TargetDipeptidyl peptidase 4
LigandBDBM50309468
Substrate/Competitorn/a
Meas. Tech.ChEMBL_609468 (CHEMBL1070385)
IC50 13±n/a nM
Citation Mattei, PBoehringer, MDi Giorgio, PFischer, HHennig, MHuwyler, JKoçer, BKuhn, BLoeffler, BMMacdonald, ANarquizian, RRauber, ESebokova, ESprecher, U Discovery of carmegliptin: a potent and long-acting dipeptidyl peptidase IV inhibitor for the treatment of type 2 diabetes. Bioorg Med Chem Lett20:1109-13 (2010) 
 
Dipeptidyl peptidase 4
Name:Dipeptidyl peptidase 4
Type:Enzyme
Mol. Mass.:88271.01
Organism:Homo sapiens (Human)
Description:P27487
Residue:766
BDBM50309468
NameBDBM50309468
Synonyms:(S)-1-((2S,3S,11bS)-2-amino-9,10-dimethoxy-2,3,4,6,7,11b-hexahydro-1H-pyrido[2,1-a]isoquinolin-3-yl)-4-methylpyrrolidin-2-one | CHEMBL591290
TypeSmall organic molecule
Emp. Form.C20H29N3O3
Mol. Mass.359.4626
SMILESCOc1cc2CCN3C[C@@H]([C@@H](N)C[C@H]3c2cc1OC)N1C[C@@H](C)CC1=O