Reaction Details
TargetAdenosine receptor A3
LigandBDBM50309478
Substrate/Competitorn/a
Meas. Tech.ChEMBL_609499 (CHEMBL1071771)
EC50 139±n/a nM
Citation Beattie, DBrearley, ABrown, ZCharlton, SJCox, BFairhurst, RAFozard, JRGedeck, PKirkham, PMeja, KNanson, LNeef, JOakman, HSpooner, GTaylor, RJTurner, RJWest, RWoodward, H Synthesis and evaluation of two series of 4'-aza-carbocyclic nucleosides as adenosine A2A receptor agonists. Bioorg Med Chem Lett20:1219-24 (2010) 
 
Adenosine receptor A3
Name:Adenosine receptor A3
Type:G Protein-Coupled Receptor (GPCR)
Mol. Mass.:36197.32
Organism:Homo sapiens (Human)
Description:P0DMS8
Residue:318
BDBM50309478
NameBDBM50309478
Synonyms:CHEMBL601514 | N-((2S,3S,4R,5R)-5-(2-(2-(1H-imidazol-4-yl)ethylamino)-6-(2,2-diphenylethylamino)-9H-purin-9-yl)-3,4-dihydroxytetrahydrofuran-2-yl)propionamide
TypeSmall organic molecule
Emp. Form.C32H37N9O3
Mol. Mass.595.6947
SMILESCCC(=O)N[C@H]1C[C@H]([C@H](O)[C@@H]1O)n1cnc2c(NCC(c3ccccc3)c3ccccc3)nc(NCCc3cnc[nH]3)nc12