Reaction Details
TargetAdenosine receptor A3
LigandBDBM50309481
Substrate/Competitorn/a
Meas. Tech.ChEMBL_609499 (CHEMBL1071771)
EC50 1640±n/a nM
Citation Beattie, DBrearley, ABrown, ZCharlton, SJCox, BFairhurst, RAFozard, JRGedeck, PKirkham, PMeja, KNanson, LNeef, JOakman, HSpooner, GTaylor, RJTurner, RJWest, RWoodward, H Synthesis and evaluation of two series of 4'-aza-carbocyclic nucleosides as adenosine A2A receptor agonists. Bioorg Med Chem Lett20:1219-24 (2010) 
 
Adenosine receptor A3
Name:Adenosine receptor A3
Type:G Protein-Coupled Receptor (GPCR)
Mol. Mass.:36197.32
Organism:Homo sapiens (Human)
Description:P0DMS8
Residue:318
BDBM50309481
NameBDBM50309481
Synonyms:CHEMBL592541 | N-((2S,3S,4R,5R)-5-(2-(2-(1-ethyl-1H-imidazol-4-yl)ethylamino)-6-(pentan-3-ylamino)-9H-purin-9-yl)-3,4-dihydroxytetrahydrofuran-2-yl)propionamide
TypeSmall organic molecule
Emp. Form.C25H39N9O3
Mol. Mass.513.6357
SMILESCCC(CC)Nc1nc(NCCc2cn(CC)cn2)nc2n(cnc12)[C@@H]1C[C@H](NC(=O)CC)[C@@H](O)[C@H]1O