Reaction Details
TargetDipeptidyl peptidase 4
LigandBDBM50309504
Substrate/Competitorn/a
Meas. Tech.ChEMBL_609519 (CHEMBL1071791)
IC50 1.2±n/a nM
Citation Boehringer, MFischer, HHennig, MHunziker, DHuwyler, JKuhn, BLoeffler, BMLuebbers, TMattei, PNarquizian, RSebokova, ESprecher, UWessel, HP Aryl- and heteroaryl-substituted aminobenzo[a]quinolizines as dipeptidyl peptidase IV inhibitors. Bioorg Med Chem Lett20:1106-8 (2010) 
 
Dipeptidyl peptidase 4
Name:Dipeptidyl peptidase 4
Type:Enzyme
Mol. Mass.:88271.01
Organism:Homo sapiens (Human)
Description:P27487
Residue:766
BDBM50309504
NameBDBM50309504
Synonyms:CHEMBL598470 | rac-3-(4-(fluoromethyl)pyridin-2-yl)-9,10-dimethoxy-2,3,4,6,7,11b-hexahydro-1H-pyrido[2,1-a]isoquinolin-2-amine
TypeSmall organic molecule
Emp. Form.C21H26FN3O2
Mol. Mass.371.4484
SMILESCOc1cc2CCN3C[C@@H](C(N)C[C@H]3c2cc1OC)c1cc(CF)ccn1