Reaction Details
Target5-hydroxytryptamine receptor 1A
LigandBDBM50309517
Substrate/Competitorn/a
Meas. Tech.ChEMBL_609532 (CHEMBL1072439)
Ki 17±n/a nM
Citation Dounay, ABBarta, NSCampbell, BMColeman, CCollantes, EMDenny, LDutta, SGray, DLHou, DIyer, RMaiti, SNOrtwine, DFProbert, AStratman, NCSubedi, RWhisman, TXu, WZoski, K Design, synthesis, and pharmacological evaluation of phenoxy pyridyl derivatives as dual norepinephrine reuptake inhibitors and 5-HT1A partial agonists. Bioorg Med Chem Lett20:1114-7 (2010) 
 
5-hydroxytryptamine receptor 1A
Name:5-hydroxytryptamine receptor 1A
Type:n/a
Mol. Mass.:46122.49
Organism:Homo sapiens (Human)
Description:n/a
Residue:422
BDBM50309517
NameBDBM50309517
Synonyms:2-(2-chloro-5-fluorophenoxy)-3-(piperidin-4-yl)pyridine | CHEMBL598560
TypeSmall organic molecule
Emp. Form.C16H16ClFN2O
Mol. Mass.306.762
SMILESFc1ccc(Cl)c(Oc2ncccc2C2CCNCC2)c1