Reaction Details
Target5-hydroxytryptamine receptor 1A
LigandBDBM50309522
Substrate/Competitorn/a
Meas. Tech.ChEMBL_609532 (CHEMBL1072439)
Ki 4.5±n/a nM
Citation Dounay, ABBarta, NSCampbell, BMColeman, CCollantes, EMDenny, LDutta, SGray, DLHou, DIyer, RMaiti, SNOrtwine, DFProbert, AStratman, NCSubedi, RWhisman, TXu, WZoski, K Design, synthesis, and pharmacological evaluation of phenoxy pyridyl derivatives as dual norepinephrine reuptake inhibitors and 5-HT1A partial agonists. Bioorg Med Chem Lett20:1114-7 (2010) 
 
5-hydroxytryptamine receptor 1A
Name:5-hydroxytryptamine receptor 1A
Type:n/a
Mol. Mass.:46122.49
Organism:Homo sapiens (Human)
Description:n/a
Residue:422
BDBM50309522
NameBDBM50309522
Synonyms:1-(2-(2-chlorophenoxy)pyridin-3-yl)piperazine | CHEMBL599593
TypeSmall organic molecule
Emp. Form.C15H16ClN3O
Mol. Mass.289.76
SMILESClc1ccccc1Oc1ncccc1N1CCNCC1