Reaction Details
TargetSodium-dependent dopamine transporter
LigandBDBM50309514
Substrate/Competitorn/a
Meas. Tech.ChEMBL_609534 (CHEMBL1073787)
Ki>6140±n/a nM
Citation Dounay, ABBarta, NSCampbell, BMColeman, CCollantes, EMDenny, LDutta, SGray, DLHou, DIyer, RMaiti, SNOrtwine, DFProbert, AStratman, NCSubedi, RWhisman, TXu, WZoski, K Design, synthesis, and pharmacological evaluation of phenoxy pyridyl derivatives as dual norepinephrine reuptake inhibitors and 5-HT1A partial agonists. Bioorg Med Chem Lett20:1114-7 (2010) 
 
Sodium-dependent dopamine transporter
Name:Sodium-dependent dopamine transporter
Type:Multi-pass membrane protein
Mol. Mass.:68497.11
Organism:Homo sapiens (Human)
Description:Q01959
Residue:620
BDBM50309514
NameBDBM50309514
Synonyms:2-(2-fluoro-4-methylphenoxy)-3-(piperidin-4-yl)pyridine | CHEMBL599371
TypeSmall organic molecule
Emp. Form.C17H19FN2O
Mol. Mass.286.344
SMILESCc1ccc(Oc2ncccc2C2CCNCC2)c(F)c1