Reaction Details
TargetSodium-dependent serotonin transporter
LigandBDBM50309515
Substrate/Competitorn/a
Meas. Tech.ChEMBL_609535 (CHEMBL1073788)
Ki 2.7±n/a nM
Citation Dounay, ABBarta, NSCampbell, BMColeman, CCollantes, EMDenny, LDutta, SGray, DLHou, DIyer, RMaiti, SNOrtwine, DFProbert, AStratman, NCSubedi, RWhisman, TXu, WZoski, K Design, synthesis, and pharmacological evaluation of phenoxy pyridyl derivatives as dual norepinephrine reuptake inhibitors and 5-HT1A partial agonists. Bioorg Med Chem Lett20:1114-7 (2010) 
 
Sodium-dependent serotonin transporter
Name:Sodium-dependent serotonin transporter
Type:Multi-pass membrane protein
Mol. Mass.:70322.51
Organism:Homo sapiens (Human)
Description:P31645
Residue:630
BDBM50309515
NameBDBM50309515
Synonyms:2-(2,4-dichlorophenoxy)-3-(piperidin-4-yl)pyridine | CHEMBL598562
TypeSmall organic molecule
Emp. Form.C16H16Cl2N2O
Mol. Mass.323.217
SMILESClc1ccc(Oc2ncccc2C2CCNCC2)c(Cl)c1