Reaction Details
TargetAngiopoietin-1 receptor
LigandBDBM50309547
Substrate/Competitorn/a
Meas. Tech.ChEMBL_609785 (CHEMBL1070752)
IC50 3961±n/a nM
Citation Ilovich, OBillauer, HDotan, SMishani, E Labeled 3-aryl-4-indolylmaleimide derivatives and their potential as angiogenic PET biomarkers. Bioorg Med Chem18:612-20 (2010) 
 
Angiopoietin-1 receptor
Name:Angiopoietin-1 receptor
Type:Enzyme
Mol. Mass.:125835.70
Organism:Homo sapiens (Human)
Description:Q02763
Residue:1124
BDBM50309547
NameBDBM50309547
Synonyms:3-(5-Iodo-1H-indol-3-yl)-4-(3,4,5-trimethoxyphenyl)-1H-pyrrole-2,5-dione | CHEMBL597492
TypeSmall organic molecule
Emp. Form.C21H17IN2O5
Mol. Mass.504.2746
SMILESCOc1cc(cc(OC)c1OC)C1=C(C(=O)NC1=O)c1c[nH]c2ccc(I)cc12