Reaction Details
TargetEstrogen receptor
LigandBDBM50309557
Substrate/Competitorn/a
Meas. Tech.ChEMBL_610114 (CHEMBL1074479)
EC50 0.028±n/a nM
Citation Kim, HYSohn, JWijewickrama, GTEdirisinghe, PGherezghiher, THemachandra, MLu, PYChandrasena, REMolloy, METonetti, DAThatcher, GR Click synthesis of estradiol-cyclodextrin conjugates as cell compartment selective estrogens. Bioorg Med Chem18:809-21 (2010) 
 
Estrogen receptor
Name:Estrogen receptor
Type:Protein
Mol. Mass.:66230.44
Organism:Homo sapiens (Human)
Description:P03372
Residue:595
BDBM50309557
NameBDBM50309557
Synonyms:CHEMBL592868 | estrogen
TypeSmall organic molecule
Emp. Form.C21H26O2
Mol. Mass.310.4299
SMILESCC#C[C@]1(O)CC[C@H]2[C@@H]3CCc4cc(O)ccc4[C@H]3CC[C@]12C