Reaction Details
TargetFatty-acid amide hydrolase 1
LigandBDBM50309691
Substrate/Competitorn/a
Meas. Tech.ChEMBL_610820 (CHEMBL1068137)
IC50 4.9±n/a nM
Citation Sit, SYConway, CMXie, KBertekap, RBourin, CBurris, KD Oxime carbamate--discovery of a series of novel FAAH inhibitors. Bioorg Med Chem Lett20:1272-7 (2010) 
 
Fatty-acid amide hydrolase 1
Name:Fatty-acid amide hydrolase 1
Type:Protein
Mol. Mass.:63071.19
Organism:Homo sapiens (Human)
Description:O00519
Residue:579
BDBM50309691
NameBDBM50309691
Synonyms:CHEMBL597216 | propan-2-one O-4-(undecyloxy)phenylcarbamoyl oxime
TypeSmall organic molecule
Emp. Form.C21H34N2O3
Mol. Mass.362.5063
SMILES[#6]-[#6]-[#6]-[#6]-[#6]-[#6]-[#6]-[#6]-[#6]-[#6]-[#6]-[#8]-c1ccc(-[#7]-[#6](=O)-[#8]\[#7]=[#6](\[#6])-[#6])cc1