Reaction Details
TargetFatty-acid amide hydrolase 1
LigandBDBM50309702
Substrate/Competitorn/a
Meas. Tech.ChEMBL_610820 (CHEMBL1068137)
IC50 0.35±n/a nM
Citation Sit, SYConway, CMXie, KBertekap, RBourin, CBurris, KD Oxime carbamate--discovery of a series of novel FAAH inhibitors. Bioorg Med Chem Lett20:1272-7 (2010) 
 
Fatty-acid amide hydrolase 1
Name:Fatty-acid amide hydrolase 1
Type:Protein
Mol. Mass.:63071.19
Organism:Homo sapiens (Human)
Description:O00519
Residue:579
BDBM50309702
NameBDBM50309702
Synonyms:CHEMBL597431 | benzaldehyde O-4-(decyloxy)phenylcarbamoyl oxime
TypeSmall organic molecule
Emp. Form.C24H32N2O3
Mol. Mass.396.5225
SMILESCCCCCCCCCCOc1ccc(NC(=O)O\N=C\c2ccccc2)cc1