Reaction Details
TargetFatty-acid amide hydrolase 1
LigandBDBM50309711
Substrate/Competitorn/a
Meas. Tech.ChEMBL_610820 (CHEMBL1068137)
IC50 0.27±n/a nM
Citation Sit, SYConway, CMXie, KBertekap, RBourin, CBurris, KD Oxime carbamate--discovery of a series of novel FAAH inhibitors. Bioorg Med Chem Lett20:1272-7 (2010) 
 
Fatty-acid amide hydrolase 1
Name:Fatty-acid amide hydrolase 1
Type:Protein
Mol. Mass.:63071.19
Organism:Homo sapiens (Human)
Description:O00519
Residue:579
BDBM50309711
NameBDBM50309711
Synonyms:4-fluorobenzaldehyde O-4-(octyloxy)phenylcarbamoyl oxime | CHEMBL597647
TypeSmall organic molecule
Emp. Form.C22H27FN2O3
Mol. Mass.386.4598
SMILESCCCCCCCCOc1ccc(NC(=O)O\N=C\c2ccc(F)cc2)cc1