Reaction Details
TargetFatty-acid amide hydrolase 1
LigandBDBM50309713
Substrate/Competitorn/a
Meas. Tech.ChEMBL_610820 (CHEMBL1068137)
IC50 0.25±n/a nM
Citation Sit, SYConway, CMXie, KBertekap, RBourin, CBurris, KD Oxime carbamate--discovery of a series of novel FAAH inhibitors. Bioorg Med Chem Lett20:1272-7 (2010) 
 
Fatty-acid amide hydrolase 1
Name:Fatty-acid amide hydrolase 1
Type:Protein
Mol. Mass.:63071.19
Organism:Homo sapiens (Human)
Description:O00519
Residue:579
BDBM50309713
NameBDBM50309713
Synonyms:4-fluorobenzaldehyde O-4-(decyloxy)phenylcarbamoyl oxime | CHEMBL596658
TypeSmall organic molecule
Emp. Form.C24H31FN2O3
Mol. Mass.414.5129
SMILESCCCCCCCCCCOc1ccc(NC(=O)O\N=C\c2ccc(F)cc2)cc1