Reaction Details
TargetFatty-acid amide hydrolase 1
LigandBDBM50309758
Substrate/Competitorn/a
Meas. Tech.ChEMBL_610820 (CHEMBL1068137)
IC50 4.6±n/a nM
Citation Sit, SYConway, CMXie, KBertekap, RBourin, CBurris, KD Oxime carbamate--discovery of a series of novel FAAH inhibitors. Bioorg Med Chem Lett20:1272-7 (2010) 
 
Fatty-acid amide hydrolase 1
Name:Fatty-acid amide hydrolase 1
Type:Protein
Mol. Mass.:63071.19
Organism:Homo sapiens (Human)
Description:O00519
Residue:579
BDBM50309758
NameBDBM50309758
Synonyms:4-fluorophenyl 4-butoxybenzylcarbamate | CHEMBL607558
TypeSmall organic molecule
Emp. Form.C18H20FNO3
Mol. Mass.317.3547
SMILESCCCCOc1ccc(CNC(=O)Oc2ccc(F)cc2)cc1