Reaction Details
TargetRibosyldihydronicotinamide dehydrogenase [quinone]
LigandBDBM50309779
Substrate/Competitorn/a
Meas. Tech.ChEMBL_610872 (CHEMBL1065027)
IC50 98±n/a nM
Citation Nolan, KAHumphries, MPBarnes, JDoncaster, JRCaraher, MCTirelli, NBryce, RAWhitehead, RCStratford, IJ Triazoloacridin-6-ones as novel inhibitors of the quinone oxidoreductases NQO1 and NQO2. Bioorg Med Chem18:696-706 (2010) 
 
Ribosyldihydronicotinamide dehydrogenase [quinone]
Name:Ribosyldihydronicotinamide dehydrogenase [quinone]
Type:Protein
Mol. Mass.:25917.25
Organism:Homo sapiens (Human)
Description:P16083
Residue:231
BDBM50309779
NameBDBM50309779
Synonyms:5-(4-methoxyphenylamino)-6H-[1,2,3]triazolo[4,5,1-de]acridin-6-one | CHEMBL611083
TypeSmall organic molecule
Emp. Form.C20H14N4O2
Mol. Mass.342.3508
SMILESCOc1ccc(Nc2ccc3nnn4c3c2c(=O)c2ccccc42)cc1