Reaction Details
TargetNAD(P)H dehydrogenase [quinone] 1
LigandBDBM50309777
Substrate/Competitorn/a
Meas. Tech.ChEMBL_610871 (CHEMBL1065026)
IC50 94±n/a nM
Citation Nolan, KAHumphries, MPBarnes, JDoncaster, JRCaraher, MCTirelli, NBryce, RAWhitehead, RCStratford, IJ Triazoloacridin-6-ones as novel inhibitors of the quinone oxidoreductases NQO1 and NQO2. Bioorg Med Chem18:696-706 (2010) 
 
NAD(P)H dehydrogenase [quinone] 1
Name:NAD(P)H dehydrogenase [quinone] 1
Type:Homodimer
Mol. Mass.:30874.82
Organism:Homo sapiens (Human)
Description:n/a
Residue:274
BDBM50309777
NameBDBM50309777
Synonyms:5-(2-(dimethylamino)ethylamino)-6H-[1,2,3]triazolo[4,5,1-de]acridin-6-one N-oxide | CHEMBL597442
TypeSmall organic molecule
Emp. Form.C17H17N5O2
Mol. Mass.323.3492
SMILESC[N+](C)([O-])CCNc1ccc2nnn3c2c1c(=O)c1ccccc31