Reaction Details
TargetNAD-dependent protein deacetylase sirtuin-1
LigandBDBM29590
Substrate/Competitorn/a
Meas. Tech.ChEMBL_611473 (CHEMBL1069455)
IC50 96200±n/a nM
Citation Pasco, MYRotili, DAltucci, LFarina, FRouleau, GAMai, ANéri, C Characterization of sirtuin inhibitors in nematodes expressing a muscular dystrophy protein reveals muscle cell and behavioral protection by specific sirtinol analogues. J Med Chem53:1407-11 (2010) 
 
NAD-dependent protein deacetylase sirtuin-1
Name:NAD-dependent protein deacetylase sirtuin-1
Type:Developmental protein; hydrolase
Mol. Mass.:81626.66
Organism:Homo sapiens (Human)
Description:n/a
Residue:747
BDBM29590
NameBDBM29590
Synonyms:1,2-Dihydro-3H-naphtho[2,1-b]pyran-3-one splitomicin
TypeSmall organic molecule
Emp. Form.C13H10O2
Mol. Mass.198.2173
SMILESO=C1CCc2c(O1)ccc1ccccc21