Reaction Details
TargetNAD-dependent protein deacetylase sirtuin-1
LigandBDBM50309833
Substrate/Competitorn/a
Meas. Tech.ChEMBL_611473 (CHEMBL1069455)
IC50 160±n/a nM
Citation Pasco, MYRotili, DAltucci, LFarina, FRouleau, GAMai, ANéri, C Characterization of sirtuin inhibitors in nematodes expressing a muscular dystrophy protein reveals muscle cell and behavioral protection by specific sirtinol analogues. J Med Chem53:1407-11 (2010) 
 
NAD-dependent protein deacetylase sirtuin-1
Name:NAD-dependent protein deacetylase sirtuin-1
Type:Developmental protein; hydrolase
Mol. Mass.:81626.66
Organism:Homo sapiens (Human)
Description:n/a
Residue:747
BDBM50309833
NameBDBM50309833
Synonyms:(S)-6-chloro-2,3,4,9-tetrahydro-1H-carbazole-1-carboxamide | CHEMBL597477
TypeSmall organic molecule
Emp. Form.C13H13ClN2O
Mol. Mass.248.708
SMILESNC(=O)[C@H]1CCCc2c1[nH]c1ccc(Cl)cc21