Reaction Details
TargetHistamine H3 receptor
LigandBDBM50309838
Substrate/Competitorn/a
Meas. Tech.ChEMBL_611486 (CHEMBL1069468)
Ki 1200±n/a nM
Citation Cole, DCGross, JLComery, TAAschmies, SHirst, WDKelley, CKim, JIKubek, KNing, XPlatt, BJRobichaud, AJSolvibile, WRStock, JRTawa, GWilliams, MJEllingboe, JW Benzimidazole- and indole-substituted 1,3'-bipyrrolidine benzamides as histamine H3 receptor antagonists. Bioorg Med Chem Lett20:1237-40 (2010) 
 
Histamine H3 receptor
Name:Histamine H3 receptor
Type:G Protein-Coupled Receptor (GPCR)
Mol. Mass.:48691.47
Organism:Homo sapiens (Human)
Description:Binding assays were using CHO cells stably expressing hH3R receptors.
Residue:445
BDBM50309838
NameBDBM50309838
Synonyms:(3-((2-hydroxyethyl)(methyl)amino)pyrrolidin-1-yl)(4-((2-phenyl-1H-benzo[d]imidazol-1-yl)methyl)phenyl)methanone | CHEMBL599368
TypeSmall organic molecule
Emp. Form.C28H30N4O2
Mol. Mass.454.5634
SMILESCN(CCO)C1CCN(C1)C(=O)c1ccc(Cn2c(nc3ccccc23)-c2ccccc2)cc1