Reaction Details
TargetHistamine H3 receptor
LigandBDBM50309834
Substrate/Competitorn/a
Meas. Tech.ChEMBL_611486 (CHEMBL1069468)
Ki 2.5±n/a nM
Citation Cole, DCGross, JLComery, TAAschmies, SHirst, WDKelley, CKim, JIKubek, KNing, XPlatt, BJRobichaud, AJSolvibile, WRStock, JRTawa, GWilliams, MJEllingboe, JW Benzimidazole- and indole-substituted 1,3'-bipyrrolidine benzamides as histamine H3 receptor antagonists. Bioorg Med Chem Lett20:1237-40 (2010) 
 
Histamine H3 receptor
Name:Histamine H3 receptor
Type:G Protein-Coupled Receptor (GPCR)
Mol. Mass.:48691.47
Organism:Homo sapiens (Human)
Description:Binding assays were using CHO cells stably expressing hH3R receptors.
Residue:445
BDBM50309834
NameBDBM50309834
Synonyms:(S)-1,3'-bipyrrolidin-1'-yl(4-((7-chloro-1H-indol-1-yl)methyl)phenyl)methanone | CHEMBL589908
TypeSmall organic molecule
Emp. Form.C24H26ClN3O
Mol. Mass.407.936
SMILESClc1cccc2ccn(Cc3ccc(cc3)C(=O)N3CC[C@@H](C3)N3CCCC3)c12