Reaction Details
TargetNeuropeptide Y receptor type 1
LigandBDBM50309854
Substrate/Competitorn/a
Meas. Tech.ChEMBL_611536 (CHEMBL1066380)
Ki 275±n/a nM
Citation Guérin, BDumulon-Perreault, VTremblay, MCAit-Mohand, SFournier, PDubuc, CAuthier, SBénard, F [Lys(DOTA)4]BVD15, a novel and potent neuropeptide Y analog designed for Y1 receptor-targeted breast tumor imaging. Bioorg Med Chem Lett20:950-3 (2010) 
 
Neuropeptide Y receptor type 1
Name:Neuropeptide Y receptor type 1
Type:Enzyme Catalytic Domain
Mol. Mass.:44399.07
Organism:Homo sapiens (Human)
Description:NPY-Y1 NPY1R HUMAN::P25929
Residue:384
BDBM50309854
NameBDBM50309854
Synonyms:(3S,6S,9S,12S,15S,18S)-1-((S)-1-((S)-2-((2S,3S)-2-acetamido-3-methylpentanamido)-4-amino-4-oxobutanoyl)pyrrolidin-2-yl)-3-(4-aminobutyl)-12-sec-butyl-9,15-bis(3-guanidinopropyl)-6,18-bis(4-hydroxybenzyl)-1,4,7,10,13,16-hexaoxo-2,5,8,11,14,17-hexaazanonadecan-19-oic acid | CHEMBL592104
TypeSmall organic molecule
Emp. Form.C75H119N21O21
Mol. Mass.1650.8755
SMILES[#6]-[#6]-[#6@H](-[#6])-[#6@H](-[#7]-[#6](-[#6])=O)-[#6](=O)-[#7]-[#6@@H](-[#6]-[#6](-[#7])=O)-[#6](=O)-[#7]-1-[#6]-[#6]-[#6]-[#6@H]-1-[#6](=O)-[#7]-[#6@@H](-[#6]-[#6]-[#6]-[#6]-[#7]-[#6](=O)-[#6]-[#7]-1-[#6]-[#6]-[#7](-[#6]-[#6](-[#8])=O)-[#6]-[#6]-[#7](-[#6]-[#6](-[#8])=O)-[#6]-[#6]-[#7](-[#6]-[#6](-[#8])=O)-[#6]-[#6]-1)-[#6](=O)-[#7]-[#6@@H](-[#6]-c1ccc(-[#8])cc1)-[#6](=O)-[#7]-[#6@@H](-[#6]-[#6]-[#6]\[#7]=[#6](/[#7])-[#7])-[#6](=O)-[#7]-[#6@@H](-[#6]-[#6](-[#6])-[#6])-[#6](=O)-[#7]-[#6@@H](-[#6]-[#6]-[#6]\[#7]=[#6](/[#7])-[#7])-[#6](=O)-[#7]-[#6@@H](-[#6]-c1ccc(-[#8])cc1)-[#6](-[#8])=O