Reaction Details
TargetNeuropeptide Y receptor type 1
LigandBDBM50309858
Substrate/Competitorn/a
Meas. Tech.ChEMBL_611536 (CHEMBL1066380)
Ki 4507±n/a nM
Citation Guérin, BDumulon-Perreault, VTremblay, MCAit-Mohand, SFournier, PDubuc, CAuthier, SBénard, F [Lys(DOTA)4]BVD15, a novel and potent neuropeptide Y analog designed for Y1 receptor-targeted breast tumor imaging. Bioorg Med Chem Lett20:950-3 (2010) 
 
Neuropeptide Y receptor type 1
Name:Neuropeptide Y receptor type 1
Type:Enzyme Catalytic Domain
Mol. Mass.:44399.07
Organism:Homo sapiens (Human)
Description:NPY-Y1 NPY1R HUMAN::P25929
Residue:384
BDBM50309858
NameBDBM50309858
Synonyms:8-{2-[4-({[(5S)-5-{[(2S)-1-[(2S)-2-[(2S,3S)-2-amino-3-methylpentanamido]-3-carbamoylpropanoyl]pyrrolidin-2-yl]formamido}-5-{[(1S)-1-{[(1S)-4-carbamimidamido-1-{[(1S)-1-{[(1S)-4-carbamimidamido-1-{[(1S)-1-carboxy-2-(4-hydroxyphenyl)ethyl]carbamoyl}butyl]carbamoyl}-3-methylbutyl]carbamoyl}butyl]carbamoyl}-2-(4-hydroxyphenyl)ethyl]carbamoyl}pentyl]carbamoyl}methyl)-7,10-bis({[(7-carboxyheptyl)carbamoyl]methyl})-1,4,7,10-tetraazacyclododecan-1-yl]acetamido}octanoic acid | CHEMBL577447
TypeSmall organic molecule
Emp. Form.C97H162N24O23
Mol. Mass.2032.4712
SMILES[#6]-[#6]-[#6@H](-[#6])-[#6@H](-[#7])-[#6](=O)-[#7]-[#6@@H](-[#6]-[#6](-[#7])=O)-[#6](=O)-[#7]-1-[#6]-[#6]-[#6]-[#6@H]-1-[#6](=O)-[#7]-[#6@@H](-[#6]-[#6]-[#6]-[#6]-[#7]-[#6](=O)-[#6]-[#7]-1-[#6]-[#6]-[#7](-[#6]-[#6](=O)-[#7]-[#6]-[#6]-[#6]-[#6]-[#6]-[#6]-[#6]-[#6](-[#8])=O)-[#6]-[#6]-[#7](-[#6]-[#6](=O)-[#7]-[#6]-[#6]-[#6]-[#6]-[#6]-[#6]-[#6]-[#6](-[#8])=O)-[#6]-[#6]-[#7](-[#6]-[#6](=O)-[#7]-[#6]-[#6]-[#6]-[#6]-[#6]-[#6]-[#6]-[#6](-[#8])=O)-[#6]-[#6]-1)-[#6](=O)-[#7]-[#6@@H](-[#6]-c1ccc(-[#8])cc1)-[#6](=O)-[#7]-[#6@@H](-[#6]-[#6]-[#6]\[#7]=[#6](/[#7])-[#7])-[#6](=O)-[#7]-[#6@@H](-[#6]-[#6](-[#6])-[#6])-[#6](=O)-[#7]-[#6@@H](-[#6]-[#6]-[#6]\[#7]=[#6](/[#7])-[#7])-[#6](=O)-[#7]-[#6@@H](-[#6]-c1ccc(-[#8])cc1)-[#6](-[#8])=O