Reaction Details
TargetNeuronal acetylcholine receptor subunit alpha-7
LigandBDBM50309895
Substrate/Competitorn/a
Meas. Tech.ChEMBL_611542 (CHEMBL1066386)
Ki 17.3±n/a nM
Citation O'Donnell, CJRogers, BNBronk, BSBryce, DKCoe, JWCook, KKDuplantier, AJEvrard, EHajós, MHoffmann, WEHurst, RSMaklad, NMather, RJMcLean, SNedza, FMO'Neill, BTPeng, LQian, WRottas, MMSands, SBSchmidt, AWShrikhande, AVSpracklin, DKWong, DFZhang, AZhang, L Discovery of 4-(5-methyloxazolo[4,5-b]pyridin-2-yl)-1,4-diazabicyclo[3.2.2]nonane (CP-810,123), a novel alpha 7 nicotinic acetylcholine receptor agonist for the treatment of cognitive disorders in schizophrenia: synthesis, SAR development, and in vivo efficacy in cognition models. J Med Chem53:1222-37 (2010) 
 
Neuronal acetylcholine receptor subunit alpha-7
Name:Neuronal acetylcholine receptor subunit alpha-7
Type:Enzyme
Mol. Mass.:56502.44
Organism:Rattus norvegicus (Rat)
Description:Q05941
Residue:502
BDBM50309895
NameBDBM50309895
Synonyms:2-(5-Phenoxyoxazolo[4,5-b]pyridin-2-yl)-2,5-diazabicyclo[3.2.2]-nonane | CHEMBL605573
TypeSmall organic molecule
Emp. Form.C19H20N4O2
Mol. Mass.336.3877
SMILESC1CN2CCC1N(CC2)c1nc2nc(Oc3ccccc3)ccc2o1