Reaction Details
TargetHistone deacetylase 4
LigandBDBM50309932
Substrate/Competitorn/a
Meas. Tech.ChEMBL_612150 (CHEMBL1073572)
IC50 5±n/a nM
Citation Islam, NMKato, TNishino, NKim, HJIto, AYoshida, M Bicyclic peptides as potent inhibitors of histone deacetylases: optimization of alkyl loop length. Bioorg Med Chem Lett20:997-9 (2010) 
 
Histone deacetylase 4
Name:Histone deacetylase 4
Type:Enzyme
Mol. Mass.:119049.39
Organism:Homo sapiens (Human)
Description:P56524
Residue:1084
BDBM50309932
NameBDBM50309932
Synonyms:6-((1R,14S,20R,23S)-15,21,24,26-Tetraoxo-16,22,25,27-tetraaza-tricyclo[12.11.2.0*16,20*]heptacos-23-yl)-hexanoic acid hydroxyamide | CHEMBL589918
TypeSmall organic molecule
Emp. Form.C29H49N5O6
Mol. Mass.563.7293
SMILESONC(=O)CCCCC[C@@H]1NC(=O)[C@H]2CCCN2C(=O)[C@@H]2CCCCCCCCCCCC[C@@H](NC1=O)C(=O)N2