Reaction Details
TargetSodium- and chloride-dependent glycine transporter 1
LigandBDBM50309959
Substrate/Competitorn/a
Meas. Tech.ChEMBL_612178 (CHEMBL1073598)
Ki 2±n/a nM
Citation Lowe, JADeninno, SLDrozda, SESchmidt, CJWard, KMDavid Tingley, FSanner, MTunucci, DValentine, J An octahydro-cyclopenta[c]pyrrole series of inhibitors of the type 1 glycine transporter. Bioorg Med Chem Lett20:907-11 (2010) 
 
Sodium- and chloride-dependent glycine transporter 1
Name:Sodium- and chloride-dependent glycine transporter 1
Type:Enzyme
Mol. Mass.:78270.54
Organism:Homo sapiens (Human)
Description:P48067
Residue:706
BDBM50309959
NameBDBM50309959
Synonyms:(exo)-1-methyl-N-(octahydrocyclopenta[c]pyrrol-5-yl)-N-(3-(trifluoromethoxy)benzyl)-1H-imidazole-4-carboxamide | CHEMBL596700
TypeSmall organic molecule
Emp. Form.C20H23F3N4O2
Mol. Mass.408.4174
SMILESCn1cnc(c1)C(=O)N(Cc1cccc(OC(F)(F)F)c1)[C@@H]1C[C@@H]2CNC[C@@H]2C1