Reaction Details
TargetSodium- and chloride-dependent glycine transporter 1
LigandBDBM50309963
Substrate/Competitorn/a
Meas. Tech.ChEMBL_612178 (CHEMBL1073598)
Ki 2.6±n/a nM
Citation Lowe, JADeninno, SLDrozda, SESchmidt, CJWard, KMDavid Tingley, FSanner, MTunucci, DValentine, J An octahydro-cyclopenta[c]pyrrole series of inhibitors of the type 1 glycine transporter. Bioorg Med Chem Lett20:907-11 (2010) 
 
Sodium- and chloride-dependent glycine transporter 1
Name:Sodium- and chloride-dependent glycine transporter 1
Type:Enzyme
Mol. Mass.:78270.54
Organism:Homo sapiens (Human)
Description:P48067
Residue:706
BDBM50309963
NameBDBM50309963
Synonyms:(exo)-N-(2-ethyloctahydrocyclopenta[c]pyrrol-5-yl)-N-(4-fluoro-3-(trifluoromethyl)benzyl)-1-methyl-1H-imidazole-4-carboxamide | CHEMBL599480
TypeSmall organic molecule
Emp. Form.C22H26F4N4O
Mol. Mass.438.4617
SMILESCCN1C[C@@H]2C[C@@H](C[C@@H]2C1)N(Cc1ccc(F)c(c1)C(F)(F)F)C(=O)c1cn(C)cn1