Reaction Details
TargetPotassium voltage-gated channel subfamily H member 2
LigandBDBM50309965
Substrate/Competitorn/a
Meas. Tech.ChEMBL_612185 (CHEMBL1074123)
Ki 3810±n/a nM
Citation Lowe, JADeninno, SLDrozda, SESchmidt, CJWard, KMDavid Tingley, FSanner, MTunucci, DValentine, J An octahydro-cyclopenta[c]pyrrole series of inhibitors of the type 1 glycine transporter. Bioorg Med Chem Lett20:907-11 (2010) 
 
Potassium voltage-gated channel subfamily H member 2
Name:Potassium voltage-gated channel subfamily H member 2
Type:Multi-pass membrane protein
Mol. Mass.:126672.65
Organism:Homo sapiens (Human)
Description:Q12809
Residue:1159
BDBM50309965
NameBDBM50309965
Synonyms:(exo)-1-Methyl-1H-imidazole-4-carboxylic acid(3-trifluoromethoxy-benzyl)-(2-(2-hydroxy, 2-methylpropyl)-octahydro-cyclopenta[c]pyrrol-5-yl)-amide | CHEMBL605744
TypeSmall organic molecule
Emp. Form.C24H31F3N4O3
Mol. Mass.480.5231
SMILESCn1cnc(c1)C(=O)N(Cc1cccc(OC(F)(F)F)c1)[C@H]1C[C@H]2CN(CC(C)(C)O)C[C@H]2C1