Reaction Details
TargetPotassium voltage-gated channel subfamily H member 2
LigandBDBM50309967
Substrate/Competitorn/a
Meas. Tech.ChEMBL_612185 (CHEMBL1074123)
Ki 4530±n/a nM
Citation Lowe, JADeninno, SLDrozda, SESchmidt, CJWard, KMDavid Tingley, FSanner, MTunucci, DValentine, J An octahydro-cyclopenta[c]pyrrole series of inhibitors of the type 1 glycine transporter. Bioorg Med Chem Lett20:907-11 (2010) 
 
Potassium voltage-gated channel subfamily H member 2
Name:Potassium voltage-gated channel subfamily H member 2
Type:Multi-pass membrane protein
Mol. Mass.:126672.65
Organism:Homo sapiens (Human)
Description:Q12809
Residue:1159
BDBM50309967
NameBDBM50309967
Synonyms:(exo)-1-methyl-N-(3-(trifluoromethoxy)benzyl)-N-(2-(3,3,3-trifluoropropyl)octahydrocyclopenta[c]pyrrol-5-yl)-1H-imidazole-4-carboxamide | CHEMBL597032
TypeSmall organic molecule
Emp. Form.C23H26F6N4O2
Mol. Mass.504.4686
SMILESCn1cnc(c1)C(=O)N(Cc1cccc(OC(F)(F)F)c1)[C@H]1C[C@H]2CN(CCC(F)(F)F)C[C@H]2C1