Reaction Details
TargetCannabinoid receptor 1
LigandBDBM50309975
Substrate/Competitorn/a
Meas. Tech.ChEMBL_612189 (CHEMBL1074127)
IC50 3.77±n/a nM
Citation Seo, HJKim, MJLee, SHLee, SHJung, MEKim, MSAhn, KKim, JLee, J Synthesis and structure-activity relationship of 1,2,4-triazole-containing diarylpyrazolyl carboxamide as CB1 cannabinoid receptor-ligand. Bioorg Med Chem18:1149-62 (2010) 
 
Cannabinoid receptor 1
Name:Cannabinoid receptor 1
Type:G Protein-Coupled Receptor (GPCR)
Mol. Mass.:52856.55
Organism:Rattus norvegicus (rat)
Description:P20272
Residue:473
BDBM50309975
NameBDBM50309975
Synonyms:4-((1H-1,2,4-Triazol-1-yl)methyl)-5-(4-chlorophenyl)-N-cyclohexyl-1-(2,4-dichlorophenyl)-1H-pyrazole-3-carboxamide | CHEMBL605757
TypeSmall organic molecule
Emp. Form.C25H23Cl3N6O
Mol. Mass.529.849
SMILESClc1ccc(cc1)-c1c(Cn2cncn2)c(nn1-c1ccc(Cl)cc1Cl)C(=O)NC1CCCCC1