Reaction Details
TargetCannabinoid receptor 1
LigandBDBM50309978
Substrate/Competitorn/a
Meas. Tech.ChEMBL_612189 (CHEMBL1074127)
IC50 3.33±n/a nM
Citation Seo, HJKim, MJLee, SHLee, SHJung, MEKim, MSAhn, KKim, JLee, J Synthesis and structure-activity relationship of 1,2,4-triazole-containing diarylpyrazolyl carboxamide as CB1 cannabinoid receptor-ligand. Bioorg Med Chem18:1149-62 (2010) 
 
Cannabinoid receptor 1
Name:Cannabinoid receptor 1
Type:G Protein-Coupled Receptor (GPCR)
Mol. Mass.:52856.55
Organism:Rattus norvegicus (rat)
Description:P20272
Residue:473
BDBM50309978
NameBDBM50309978
Synonyms:4-((1H-1,2,4-Triazol-1-yl)methyl)-5-(4-chlorophenyl)-N-(2-(4-chlorophenyl)propan-2-yl)-1-(2,4-dichlorophenyl)-1Hpyrazole-3-carboxamide | CHEMBL597895
TypeSmall organic molecule
Emp. Form.C28H22Cl4N6O
Mol. Mass.600.326
SMILESCc1cc(Cl)cc(C)c1CNC(=O)c1nn(c(c1Cn1cncn1)-c1ccc(Cl)cc1)-c1ccc(Cl)cc1Cl