Reaction Details
TargetCannabinoid receptor 1
LigandBDBM50309998
Substrate/Competitorn/a
Meas. Tech.ChEMBL_612189 (CHEMBL1074127)
IC50 2.8±n/a nM
Citation Seo, HJKim, MJLee, SHLee, SHJung, MEKim, MSAhn, KKim, JLee, J Synthesis and structure-activity relationship of 1,2,4-triazole-containing diarylpyrazolyl carboxamide as CB1 cannabinoid receptor-ligand. Bioorg Med Chem18:1149-62 (2010) 
 
Cannabinoid receptor 1
Name:Cannabinoid receptor 1
Type:G Protein-Coupled Receptor (GPCR)
Mol. Mass.:52856.55
Organism:Rattus norvegicus (rat)
Description:P20272
Residue:473
BDBM50309998
NameBDBM50309998
Synonyms:4-((1H-1,2,4-Triazol-1-yl)methyl)-5-(4-bromophenyl)-N-(1-(4-chlorophenyl)cyclopropyl)-1-(2,4-dichlorophenyl)-1Hpyrazole-3-carboxamide | CHEMBL596716
TypeSmall organic molecule
Emp. Form.C28H20BrCl3N6O
Mol. Mass.642.761
SMILESClc1ccc(cc1)C1(CC1)NC(=O)c1nn(c(c1Cn1cncn1)-c1ccc(Br)cc1)-c1ccc(Cl)cc1Cl