Reaction Details
TargetCannabinoid receptor 2
LigandBDBM50310006
Substrate/Competitorn/a
Meas. Tech.ChEMBL_612190 (CHEMBL1074128)
IC50 296±n/a nM
Citation Seo, HJKim, MJLee, SHLee, SHJung, MEKim, MSAhn, KKim, JLee, J Synthesis and structure-activity relationship of 1,2,4-triazole-containing diarylpyrazolyl carboxamide as CB1 cannabinoid receptor-ligand. Bioorg Med Chem18:1149-62 (2010) 
 
Cannabinoid receptor 2
Name:Cannabinoid receptor 2
Type:G Protein-Coupled Receptor (GPCR)
Mol. Mass.:39690.94
Organism:Homo sapiens (Human)
Description:P34972
Residue:360
BDBM50310006
NameBDBM50310006
Synonyms:(4-((1H-1,2,4-Triazol-1-yl)methyl)-5-(4-bromophenyl)-1-(2-chlorophenyl)-1H-pyrazol-3-yl)(4-(3-chlorophenyl)piperazin-1-yl)methanone | CHEMBL597489
TypeSmall organic molecule
Emp. Form.C29H24BrCl2N7O
Mol. Mass.637.357
SMILESClc1cccc(c1)N1CCN(CC1)C(=O)c1nn(c(c1Cn1cncn1)-c1ccc(Br)cc1)-c1ccccc1Cl