Reaction Details
TargetCannabinoid receptor 2
LigandBDBM50310007
Substrate/Competitorn/a
Meas. Tech.ChEMBL_612190 (CHEMBL1074128)
IC50 582±n/a nM
Citation Seo, HJKim, MJLee, SHLee, SHJung, MEKim, MSAhn, KKim, JLee, J Synthesis and structure-activity relationship of 1,2,4-triazole-containing diarylpyrazolyl carboxamide as CB1 cannabinoid receptor-ligand. Bioorg Med Chem18:1149-62 (2010) 
 
Cannabinoid receptor 2
Name:Cannabinoid receptor 2
Type:G Protein-Coupled Receptor (GPCR)
Mol. Mass.:39690.94
Organism:Homo sapiens (Human)
Description:P34972
Residue:360
BDBM50310007
NameBDBM50310007
Synonyms:(4-((1H-1,2,4-Triazol-1-yl)methyl)-5-(4-bromophenyl)-1-(2-chlorophenyl)-1H-pyrazol-3-yl)(4-(2,3-dichlorophenyl)piperazin-1-yl)methanone | CHEMBL603053
TypeSmall organic molecule
Emp. Form.C29H23BrCl3N7O
Mol. Mass.671.802
SMILESClc1cccc(N2CCN(CC2)C(=O)c2nn(c(c2Cn2cncn2)-c2ccc(Br)cc2)-c2ccccc2Cl)c1Cl