Reaction Details
TargetCannabinoid receptor 1
LigandBDBM50309995
Substrate/Competitorn/a
Meas. Tech.ChEMBL_612192 (CHEMBL1074130)
IC50 28.2±n/a nM
Citation Seo, HJKim, MJLee, SHLee, SHJung, MEKim, MSAhn, KKim, JLee, J Synthesis and structure-activity relationship of 1,2,4-triazole-containing diarylpyrazolyl carboxamide as CB1 cannabinoid receptor-ligand. Bioorg Med Chem18:1149-62 (2010) 
 
Cannabinoid receptor 1
Name:Cannabinoid receptor 1
Type:G Protein-Coupled Receptor (GPCR)
Mol. Mass.:52868.96
Organism:Homo sapiens (Human)
Description:P21554
Residue:472
BDBM50309995
NameBDBM50309995
Synonyms:4-((1H-1,2,4-Triazol-1-yl)methyl)-5-(4-bromophenyl)-N-(1-(4-bromophenyl)ethyl)-1-(2,4-dichlorophenyl)-1H-pyrazole-3-carboxamide | CHEMBL598549
TypeSmall organic molecule
Emp. Form.C27H20Br2Cl2N6O
Mol. Mass.675.201
SMILESCc1cc(Br)ccc1CNC(=O)c1nn(c(c1Cn1cncn1)-c1ccc(Br)cc1)-c1ccc(Cl)cc1Cl