Reaction Details
TargetCannabinoid receptor 1
LigandBDBM50310021
Substrate/Competitorn/a
Meas. Tech.ChEMBL_612189 (CHEMBL1074127)
IC50 11.5±n/a nM
Citation Seo, HJKim, MJLee, SHLee, SHJung, MEKim, MSAhn, KKim, JLee, J Synthesis and structure-activity relationship of 1,2,4-triazole-containing diarylpyrazolyl carboxamide as CB1 cannabinoid receptor-ligand. Bioorg Med Chem18:1149-62 (2010) 
 
Cannabinoid receptor 1
Name:Cannabinoid receptor 1
Type:G Protein-Coupled Receptor (GPCR)
Mol. Mass.:52856.55
Organism:Rattus norvegicus (rat)
Description:P20272
Residue:473
BDBM50310021
NameBDBM50310021
Synonyms:(4-((1H-1,2,4-Triazol-1-yl)methyl)-1-(2-chlorophenyl)-5-(4-chlorophenyl)-1H-pyrazol-3-yl)(4-phenylpiperazin-1-yl)methanone | CHEMBL605421
TypeSmall organic molecule
Emp. Form.C29H25Cl2N7O
Mol. Mass.558.461
SMILESClc1ccc(cc1)-c1c(Cn2cncn2)c(nn1-c1ccccc1Cl)C(=O)N1CCN(CC1)c1ccccc1