Reaction Details
TargetCannabinoid receptor 1
LigandBDBM50310042
Substrate/Competitorn/a
Meas. Tech.ChEMBL_612189 (CHEMBL1074127)
IC50 12.9±n/a nM
Citation Seo, HJKim, MJLee, SHLee, SHJung, MEKim, MSAhn, KKim, JLee, J Synthesis and structure-activity relationship of 1,2,4-triazole-containing diarylpyrazolyl carboxamide as CB1 cannabinoid receptor-ligand. Bioorg Med Chem18:1149-62 (2010) 
 
Cannabinoid receptor 1
Name:Cannabinoid receptor 1
Type:G Protein-Coupled Receptor (GPCR)
Mol. Mass.:52856.55
Organism:Rattus norvegicus (rat)
Description:P20272
Residue:473
BDBM50310042
NameBDBM50310042
Synonyms:4-((1H-1,2,4-triazol-1-yl)methyl)-5-(4-chlorophenyl)-1-(2,4-dichlorophenyl)-N-((1S,2S)-2-methylcyclohexyl)-1H-pyrazole-3-carboxamide | CHEMBL598094
TypeSmall organic molecule
Emp. Form.C26H25Cl3N6O
Mol. Mass.543.875
SMILESC[C@H]1CCCC[C@@H]1NC(=O)c1nn(c(c1Cn1cncn1)-c1ccc(Cl)cc1)-c1ccc(Cl)cc1Cl