Reaction Details
TargetCannabinoid receptor 1
LigandBDBM50310047
Substrate/Competitorn/a
Meas. Tech.ChEMBL_612189 (CHEMBL1074127)
IC50 22.3±n/a nM
Citation Seo, HJKim, MJLee, SHLee, SHJung, MEKim, MSAhn, KKim, JLee, J Synthesis and structure-activity relationship of 1,2,4-triazole-containing diarylpyrazolyl carboxamide as CB1 cannabinoid receptor-ligand. Bioorg Med Chem18:1149-62 (2010) 
 
Cannabinoid receptor 1
Name:Cannabinoid receptor 1
Type:G Protein-Coupled Receptor (GPCR)
Mol. Mass.:52856.55
Organism:Rattus norvegicus (rat)
Description:P20272
Residue:473
BDBM50310047
NameBDBM50310047
Synonyms:(4-((1H-1,2,4-Triazol-1-yl)methyl)-5-(4-bromophenyl)-1-(2-chlorophenyl)-1H-pyrazol-3-yl)(4-(pyrimidin-2-yl)piperazin-1-yl)methanone | CHEMBL597690
TypeSmall organic molecule
Emp. Form.C27H23BrClN9O
Mol. Mass.604.888
SMILESClc1ccccc1-n1nc(C(=O)N2CCN(CC2)c2ncccn2)c(Cn2cncn2)c1-c1ccc(Br)cc1