Reaction Details
TargetCannabinoid receptor 1
LigandBDBM50310008
Substrate/Competitorn/a
Meas. Tech.ChEMBL_612189 (CHEMBL1074127)
IC50 2.07±n/a nM
Citation Seo, HJKim, MJLee, SHLee, SHJung, MEKim, MSAhn, KKim, JLee, J Synthesis and structure-activity relationship of 1,2,4-triazole-containing diarylpyrazolyl carboxamide as CB1 cannabinoid receptor-ligand. Bioorg Med Chem18:1149-62 (2010) 
 
Cannabinoid receptor 1
Name:Cannabinoid receptor 1
Type:G Protein-Coupled Receptor (GPCR)
Mol. Mass.:52856.55
Organism:Rattus norvegicus (rat)
Description:P20272
Residue:473
BDBM50310008
NameBDBM50310008
Synonyms:(4-((1H-1,2,4-Triazol-1-yl)methyl)-5-(4-bromophenyl)-1-(2-chlorophenyl)-1H-pyrazol-3-yl)(4-(2,3-dimethylphenyl)piperazin-1-yl)methanone | CHEMBL603054
TypeSmall organic molecule
Emp. Form.C31H29BrClN7O
Mol. Mass.630.965
SMILESCc1cccc(N2CCN(CC2)C(=O)c2nn(c(c2Cn2cncn2)-c2ccc(Br)cc2)-c2ccccc2Cl)c1C