Reaction Details
TargetCannabinoid receptor 1
LigandBDBM50310061
Substrate/Competitorn/a
Meas. Tech.ChEMBL_612189 (CHEMBL1074127)
IC50 6.6±n/a nM
Citation Seo, HJKim, MJLee, SHLee, SHJung, MEKim, MSAhn, KKim, JLee, J Synthesis and structure-activity relationship of 1,2,4-triazole-containing diarylpyrazolyl carboxamide as CB1 cannabinoid receptor-ligand. Bioorg Med Chem18:1149-62 (2010) 
 
Cannabinoid receptor 1
Name:Cannabinoid receptor 1
Type:G Protein-Coupled Receptor (GPCR)
Mol. Mass.:52856.55
Organism:Rattus norvegicus (rat)
Description:P20272
Residue:473
BDBM50310061
NameBDBM50310061
Synonyms:4-((1H-1,2,4-Triazol-1-yl)methyl)-1-(2-chlorophenyl)-5-(4-chlorophenyl)-N-cyclohexyl-1H-pyrazole-3-carboxamide | CHEMBL598539
TypeSmall organic molecule
Emp. Form.C25H24Cl2N6O
Mol. Mass.495.404
SMILESClc1ccc(cc1)-c1c(Cn2cncn2)c(nn1-c1ccccc1Cl)C(=O)NC1CCCCC1