Reaction Details
TargetFructose-1,6-bisphosphatase 1
LigandBDBM50310087
Substrate/Competitorn/a
Meas. Tech.ChEMBL_612215 (CHEMBL1074153)
IC50 10±n/a nM
Citation Tsukada, TTakahashi, MTakemoto, TKanno, OYamane, TKawamura, SNishi, T Structure-based drug design of tricyclic 8H-indeno[1,2-d][1,3]thiazoles as potent FBPase inhibitors. Bioorg Med Chem Lett20:1004-7 (2010) 
 
Fructose-1,6-bisphosphatase 1
Name:Fructose-1,6-bisphosphatase 1
Type:Protein
Mol. Mass.:36843.58
Organism:Homo sapiens (Human)
Description:Liver FBPase (P09467)
Residue:338
BDBM50310087
NameBDBM50310087
Synonyms:(6,7-dimethyl-8H-indeno[1,2-d]thiazol-4-yloxy)methylphosphonic acid | CHEMBL609616
TypeSmall organic molecule
Emp. Form.C13H14NO4PS
Mol. Mass.311.293
SMILESCc1cc(OCP(O)(O)=O)c-2c(Cc3scnc-23)c1C