Reaction Details
TargetFructose-1,6-bisphosphatase 1
LigandBDBM50310082
Substrate/Competitorn/a
Meas. Tech.ChEMBL_612215 (CHEMBL1074153)
IC50 12±n/a nM
Citation Tsukada, TTakahashi, MTakemoto, TKanno, OYamane, TKawamura, SNishi, T Structure-based drug design of tricyclic 8H-indeno[1,2-d][1,3]thiazoles as potent FBPase inhibitors. Bioorg Med Chem Lett20:1004-7 (2010) 
 
Fructose-1,6-bisphosphatase 1
Name:Fructose-1,6-bisphosphatase 1
Type:Protein
Mol. Mass.:36843.58
Organism:Homo sapiens (Human)
Description:Liver FBPase (P09467)
Residue:338
BDBM50310082
NameBDBM50310082
Synonyms:(8H-indeno[1,2-d]thiazol-4-yloxy)methylphosphonic acid [(8H-indeno[1,2-d][1,3]thiazol-4-yloxy)methyl]phosphonic acid
TypeSmall organic molecule
Emp. Form.C11H10NO4PS
Mol. Mass.283.24
SMILESOP(O)(=O)COc1cccc2Cc3scnc3-c12