Reaction Details
TargetProtein kinase C alpha type
LigandBDBM50310131
Substrate/Competitorn/a
Meas. Tech.ChEMBL_612235 (CHEMBL1074175)
Ki 2.9±n/a nM
Citation Kang, JHKim, YWon, SHPark, SKLee, CWKim, HMLewin, NEPerry, NAPearce, LVLundberg, DJSurawski, RJBlumberg, PMLee, J Polar 3-alkylidene-5-pivaloyloxymethyl-5'-hydroxymethyl-gamma-lactones as protein kinase C ligands and antitumor agents. Bioorg Med Chem Lett20:1008-12 (2010) 
 
Protein kinase C alpha type
Name:Protein kinase C alpha type
Type:Enzyme
Mol. Mass.:76755.65
Organism:Homo sapiens (Human)
Description:The recombinant human PKC enzymes were produced using a baculovirus expression system in SF9 cells
Residue:672
BDBM50310131
NameBDBM50310131
Synonyms:(2-hydroxy-4-(3-isobutyl-5-methylhexylidene)-5-oxotetrahydrofuran-2-yl)methyl pivalate | CHEMBL597015
TypeSmall organic molecule
Emp. Form.C21H36O5
Mol. Mass.368.5075
SMILESCC(C)CC(C\C=C1\CC(O)(COC(=O)C(C)(C)C)OC1=O)CC(C)C