Reaction Details
TargetProtein kinase C alpha type
LigandBDBM50310106
Substrate/Competitorn/a
Meas. Tech.ChEMBL_612235 (CHEMBL1074175)
Ki 8.1±n/a nM
Citation Kang, JHKim, YWon, SHPark, SKLee, CWKim, HMLewin, NEPerry, NAPearce, LVLundberg, DJSurawski, RJBlumberg, PMLee, J Polar 3-alkylidene-5-pivaloyloxymethyl-5'-hydroxymethyl-gamma-lactones as protein kinase C ligands and antitumor agents. Bioorg Med Chem Lett20:1008-12 (2010) 
 
Protein kinase C alpha type
Name:Protein kinase C alpha type
Type:Enzyme
Mol. Mass.:76755.65
Organism:Homo sapiens (Human)
Description:The recombinant human PKC enzymes were produced using a baculovirus expression system in SF9 cells
Residue:672
BDBM50310106
NameBDBM50310106
Synonyms:(E)-(2-(hydroxymethyl)-5-oxo-4-(8-(pentyloxy)octylidene)tetrahydrofuran-2-yl)methyl pivalate | CHEMBL597633
TypeSmall organic molecule
Emp. Form.C24H42O6
Mol. Mass.426.5867
SMILESCCCCCOCCCCCCC\C=C1/CC(CO)(COC(=O)C(C)(C)C)OC1=O