Reaction Details
TargetProtein kinase C alpha type
LigandBDBM50310101
Substrate/Competitorn/a
Meas. Tech.ChEMBL_612235 (CHEMBL1074175)
Ki 7.2±n/a nM
Citation Kang, JHKim, YWon, SHPark, SKLee, CWKim, HMLewin, NEPerry, NAPearce, LVLundberg, DJSurawski, RJBlumberg, PMLee, J Polar 3-alkylidene-5-pivaloyloxymethyl-5'-hydroxymethyl-gamma-lactones as protein kinase C ligands and antitumor agents. Bioorg Med Chem Lett20:1008-12 (2010) 
 
Protein kinase C alpha type
Name:Protein kinase C alpha type
Type:Enzyme
Mol. Mass.:76755.65
Organism:Homo sapiens (Human)
Description:The recombinant human PKC enzymes were produced using a baculovirus expression system in SF9 cells
Residue:672
BDBM50310101
NameBDBM50310101
Synonyms:(Z)-(2-(hydroxymethyl)-5-oxo-4-tetradecylidenetetrahydrofuran-2-yl)methyl pivalate | CHEMBL608439
TypeSmall organic molecule
Emp. Form.C25H44O5
Mol. Mass.424.6139
SMILESCCCCCCCCCCCCC\C=C1\CC(CO)(COC(=O)C(C)(C)C)OC1=O