Reaction Details
TargetAmine oxidase [flavin-containing] A
LigandBDBM15581
Substrate/Competitorn/a
Meas. Tech.ChEMBL_612769 (CHEMBL1071595)
IC50 4±n/a nM
Citation Chimenti, FFioravanti, RBolasco, AChimenti, PSecci, DRossi, FYáñez, MOrallo, FOrtuso, FAlcaro, SCirilli, RFerretti, RSanna, ML A new series of flavones, thioflavones, and flavanones as selective monoamine oxidase-B inhibitors. Bioorg Med Chem18:1273-9 (2010) 
 
Amine oxidase [flavin-containing] A
Name:Amine oxidase [flavin-containing] A
Type:Protein
Mol. Mass.:59689.53
Organism:Homo sapiens (Human)
Description:P21397
Residue:527
BDBM15581
NameBDBM15581
Synonyms:CHEMBL8706 CLORGILINE N-[3-(2,4-dichlorophenoxy)propyl]-N-methyl-prop-2-yn-1-amine US9603833, Clorgyline | [3-(2,4-dichlorophenoxy)propyl](methyl)prop-2-yn-1-ylamine
TypeSmall organic molecule
Emp. Form.C13H15Cl2NO
Mol. Mass.272.17
SMILESCN(CCCOc1ccc(Cl)cc1Cl)CC#C