Reaction Details
TargetcAMP-specific 3',5'-cyclic phosphodiesterase 4D
LigandBDBM50310210
Substrate/Competitorn/a
Meas. Tech.ChEMBL_607913 (CHEMBL1066241)
IC50 20±n/a nM
Citation Kim, ISong, JHPark, CMJeong, JWKim, HRHa, JRNo, ZHyun, YLCho, YSSook Kang, NJeon, DJ Design, synthesis, and evaluation of 2-aryl-7-(3',4'-dialkoxyphenyl)-pyrazolo[1,5-a]pyrimidines as novel PDE-4 inhibitors. Bioorg Med Chem Lett20:922-6 (2010) 
 
cAMP-specific 3',5'-cyclic phosphodiesterase 4D
Name:cAMP-specific 3',5'-cyclic phosphodiesterase 4D
Type:Protein
Mol. Mass.:91092.69
Organism:Homo sapiens (Human)
Description:Q08499
Residue:809
BDBM50310210
NameBDBM50310210
Synonyms:7-(3'-Cyclopentyloxy-4'-methoxyphenyl)-2-(3-chlorophenyl)pyrazolo[1,5-a]pyrimidine | CHEMBL600990
TypeSmall organic molecule
Emp. Form.C24H22ClN3O2
Mol. Mass.419.903
SMILESCOc1ccc(cc1OC1CCCC1)-c1ccnc2cc(nn12)-c1cccc(Cl)c1