Reaction Details
TargetcAMP-specific 3',5'-cyclic phosphodiesterase 4D
LigandBDBM50310226
Substrate/Competitorn/a
Meas. Tech.ChEMBL_607913 (CHEMBL1066241)
IC50 18±n/a nM
Citation Kim, ISong, JHPark, CMJeong, JWKim, HRHa, JRNo, ZHyun, YLCho, YSSook Kang, NJeon, DJ Design, synthesis, and evaluation of 2-aryl-7-(3',4'-dialkoxyphenyl)-pyrazolo[1,5-a]pyrimidines as novel PDE-4 inhibitors. Bioorg Med Chem Lett20:922-6 (2010) 
 
cAMP-specific 3',5'-cyclic phosphodiesterase 4D
Name:cAMP-specific 3',5'-cyclic phosphodiesterase 4D
Type:Protein
Mol. Mass.:91092.69
Organism:Homo sapiens (Human)
Description:Q08499
Residue:809
BDBM50310226
NameBDBM50310226
Synonyms:Acetic acid 3-[7-(3'-cyclopropylmethoxy-4'-difluoromethoxy-phenyl)-pyrazolo[1,5-a]pyrimidin-2-yl]-phenyl ester | CHEMBL604107
TypeSmall organic molecule
Emp. Form.C25H21F2N3O4
Mol. Mass.465.4487
SMILESCC(=O)Oc1cccc(c1)-c1cc2nccc(-c3ccc(OC(F)F)c(OCC4CC4)c3)n2n1