Reaction Details
TargetcAMP-specific 3',5'-cyclic phosphodiesterase 4D
LigandBDBM50310235
Substrate/Competitorn/a
Meas. Tech.ChEMBL_607913 (CHEMBL1066241)
IC50 9±n/a nM
Citation Kim, ISong, JHPark, CMJeong, JWKim, HRHa, JRNo, ZHyun, YLCho, YSSook Kang, NJeon, DJ Design, synthesis, and evaluation of 2-aryl-7-(3',4'-dialkoxyphenyl)-pyrazolo[1,5-a]pyrimidines as novel PDE-4 inhibitors. Bioorg Med Chem Lett20:922-6 (2010) 
 
cAMP-specific 3',5'-cyclic phosphodiesterase 4D
Name:cAMP-specific 3',5'-cyclic phosphodiesterase 4D
Type:Protein
Mol. Mass.:91092.69
Organism:Homo sapiens (Human)
Description:Q08499
Residue:809
BDBM50310235
NameBDBM50310235
Synonyms:3-[7-(3'-Cyclopropylmethoxy-4'-difluoromethoxyphenyl)-pyrazolo[1,5-a]pyrimidin-2-yl]-benzoic acid | CHEMBL598086
TypeSmall organic molecule
Emp. Form.C24H19F2N3O4
Mol. Mass.451.4222
SMILESOC(=O)c1cccc(c1)-c1cc2nccc(-c3ccc(OC(F)F)c(OCC4CC4)c3)n2n1