Reaction Details
TargetAntithrombin-III
LigandBDBM50310312
Substrate/Competitorn/a
Meas. Tech.ChEMBL_607976 (CHEMBL1072392)
IC50>300000±n/a nM
Citation El-Ayache, NCLi, SHWarnock, MLawrence, DAEmal, CD Novel bis-arylsulfonamides and aryl sulfonimides as inactivators of plasminogen activator inhibitor-1 (PAI-1). Bioorg Med Chem Lett20:966-70 (2010) 
 
Antithrombin-III
Name:Antithrombin-III
Type:PROTEIN
Mol. Mass.:52602.34
Organism:Homo sapiens (Human)
Description:ChEMBL_35871
Residue:464
BDBM50310312
NameBDBM50310312
Synonyms:CHEMBL597509 | N,N'-bis(3,4-dihydroxybenzenesulfonyl)piperazine
TypeSmall organic molecule
Emp. Form.C16H18N2O8S2
Mol. Mass.430.453
SMILESOc1ccc(cc1O)S(=O)(=O)N1CCN(CC1)S(=O)(=O)c1ccc(O)c(O)c1